2.6.18-rc2-git7 build error with CONFIG_STACK_UNWIND enabled

From: Jesper Juhl
Date: Sat Jul 29 2006 - 09:40:04 EST

For Your Information :

With 2.6.18-rc2-git7 I get the following build error if I have

CC arch/i386/kernel/traps.o
arch/i386/kernel/traps.c: In function `show_trace_log_lvl':
arch/i386/kernel/traps.c:193: error: invalid type argument of `->'
arch/i386/kernel/traps.c:196: error: invalid type argument of `->'
arch/i386/kernel/traps.c:197: error: invalid type argument of `->'
make[1]: *** [arch/i386/kernel/traps.o] Error 1
make: *** [arch/i386/kernel] Error 2

Jesper Juhl <jesper.juhl@xxxxxxxxx>
Don't top-post http://www.catb.org/~esr/jargon/html/T/top-post.html
Plain text mails only, please http://www.expita.com/nomime.html
To unsubscribe from this list: send the line "unsubscribe linux-kernel" in
the body of a message to majordomo@xxxxxxxxxxxxxxx
More majordomo info at http://vger.kernel.org/majordomo-info.html
Please read the FAQ at http://www.tux.org/lkml/