[PATCH] 2.6.25-rc3-git5 Build fails on s390x

From: Kamalesh Babulal
Date: Tue Mar 04 2008 - 06:38:49 EST


The 2.6.25-rc3-git5 kernel build fails on s390x with

drivers/s390/char/defkeymap.c:155: error: missing terminating ' character
drivers/s390/char/defkeymap.c:156: error: syntax error before ';' token
make[2]: *** [drivers/s390/char/defkeymap.o] Error 1
make[1]: *** [drivers/s390/char] Error 2
make: *** [drivers/s390] Error 2

I have tested the patch for build failure only.

Signed-off-by: Kamalesh Babulal <kamalesh@xxxxxxxxxxxxxxxxxx>
--
diff --git a/drivers/s390/char/defkeymap.c b/drivers/s390/char/defkeymap.c
index 9692d6a..07c7f31 100644
--- a/drivers/s390/char/defkeymap.c
+++ b/drivers/s390/char/defkeymap.c
@@ -152,7 +152,7 @@ char *func_table[MAX_NR_FUNC] = {

struct kbdiacruc accent_table[MAX_DIACR] = {
{'^', 'c', 0003}, {'^', 'd', 0004},
- {'^', 'z', 0032}, {'^', 0012', 0000},
+ {'^', 'z', 0032}, {'^', 0012, 0000},
};

unsigned int accent_table_size = 4;
--
Thanks & Regards,
Kamalesh Babulal,
Linux Technology Center,
IBM, ISTL.
--
To unsubscribe from this list: send the line "unsubscribe linux-kernel" in
the body of a message to majordomo@xxxxxxxxxxxxxxx
More majordomo info at http://vger.kernel.org/majordomo-info.html
Please read the FAQ at http://www.tux.org/lkml/