2.6.23-rc7-mm1 -- s390 compile failures

From: Andy Whitcroft
Date: Mon Sep 24 2007 - 08:32:29 EST

Getting compile errors on S390:

CC arch/s390/mm/cmm.o
arch/s390/mm/cmm.c: In function `cmm_init':
arch/s390/mm/cmm.c:431: error: implicit declaration of function
arch/s390/mm/cmm.c:443: error: implicit declaration of function
make[1]: *** [arch/s390/mm/cmm.o] Error 1
make: *** [arch/s390/mm] Error 2

To unsubscribe from this list: send the line "unsubscribe linux-kernel" in
the body of a message to majordomo@xxxxxxxxxxxxxxx
More majordomo info at http://vger.kernel.org/majordomo-info.html
Please read the FAQ at http://www.tux.org/lkml/