2.5.60 : fs/ncpfs/sock.c compile error

From: Frank Davis (fdavis@si.rr.com)
Date: Mon Feb 10 2003 - 16:06:48 EST

Hello all,
  While compiling 2.5.60, I received the following error.

fs/ncpfs/sock.c: In function `ncp_do_request':
fs/ncpfs/sock.c:760: structure has no member named `sig'
fs/ncpfs/sock.c:762: structure has no member named `sig'
make[2]: *** [fs/ncpfs/sock.o] Error 1
make[1]: *** [fs/ncpfs] Error 2
make: *** [fs] Error 2

To unsubscribe from this list: send the line "unsubscribe linux-kernel" in
the body of a message to majordomo@vger.kernel.org
More majordomo info at http://vger.kernel.org/majordomo-info.html
Please read the FAQ at http://www.tux.org/lkml/

This archive was generated by hypermail 2b29 : Sat Feb 15 2003 - 22:00:30 EST