make error while building 2.5.31

From: Clemens 'Gullevek' Schwaighofer (schwaigl@eunet.at)
Date: Wed Aug 21 2002 - 14:20:29 EST


Hello Linux,
it's 20:57 on 21.08.2002

aty128fb.c: In function `aty128fb_set_var':
aty128fb.c:1406: warning: implicit declaration of function `do_install_cmap'
aty128fb.c: In function `aty128_init':
aty128fb.c:1752: incompatible type for argument 1 of `fb_alloc_cmap'
make[3]: *** [aty128fb.o] Error 1
make[3]: Leaving directory `/usr/src/kernel/2.5.31/linux-2.5.31/drivers/video'
make[2]: *** [video] Error 2
make[2]: Leaving directory `/usr/src/kernel/2.5.31/linux-2.5.31/drivers'
make[1]: *** [drivers] Error 2
make[1]: Leaving directory `/usr/src/kernel/2.5.31/linux-2.5.31'
make: *** [bzImage] Error 2

system: RedHat 7.3 with gcc 3.2-1 from rawhide, rest is 7.3 rpms.

config as attachment.

Best regards, Clemens

-- 
_________/\_____________________              ^_^             ()~()
Clemens 'Gullevek' Schwaighofer \_______ @_@       ^_~       //@ @\\
ICQ#: 9646646        I AM FROM AUSTRIA! \______________ _ //\ ~ /\\
http://www.animeundmanga.at | http://www.gullevek.org  \_____________


- To unsubscribe from this list: send the line "unsubscribe linux-kernel" in the body of a message to majordomo@vger.kernel.org More majordomo info at http://vger.kernel.org/majordomo-info.html Please read the FAQ at http://www.tux.org/lkml/



This archive was generated by hypermail 2b29 : Fri Aug 23 2002 - 22:00:23 EST